BDBM67650 3-methyl-4-[[(Z)-(2-oxidanylidenenaphthalen-1-ylidene)methyl]amino]benzoic acid::3-methyl-4-[[(Z)-(2-oxo-1-naphthalenylidene)methyl]amino]benzoic acid::3-methyl-4-[[(Z)-(2-oxonaphthalen-1-ylidene)methyl]amino]benzoic acid::4-[(2-Hydroxy-naphthalen-1-ylmethylene)-amino]-3-methyl-benzoic acid::4-[[(Z)-(2-keto-1-naphthylidene)methyl]amino]-3-methyl-benzoic acid::MLS001211910::SMR000513364::cid_5409911
SMILES Cc1cc(ccc1N=Cc1c(O)ccc2ccccc12)C(O)=O
InChI Key InChIKey=HCGGUBXKKWXERU-UHFFFAOYSA-N
Data  1 EC50
  Tab Delimited (TSV)   2D SDfile   Computed 3D by Vconf -m prep SDfile
Find this compound or compounds like it in BindingDB:
Activity Spreadsheet -- Enzyme Inhibition Constant Data from BindingDB
Found 1 hit for monomerid = 67650
TargetSerine/threonine-protein kinase 33(Homo sapiens (Human))
Broad Institute
Curated by PubChem BioAssay
LigandPNGBDBM67650(3-methyl-4-[[(Z)-(2-oxidanylidenenaphthalen-1-ylid...)
Affinity DataEC50:  2.27E+4nM. Assay description: Keywords: STK33 Kinase, Non-ATP Competitive Inhibitor Assay Overview: Purified STK33 Kinase is preincubated with potential inhibitors and allowed to ...
In DepthDetails PCBioAssay